[Jenkins] Sling » sling-org-apache-sling-launchpad-testing » master #268 is BROKEN

classic Classic list List threaded Threaded
2 messages Options
Reply | Threaded
Open this post in threaded view
|

[Jenkins] Sling » sling-org-apache-sling-launchpad-testing » master #268 is BROKEN

Apache Jenkins Server-2
Please see https://builds.apache.org/job/Sling/job/sling-org-apache-sling-launchpad-testing/job/master/268/ for details.

No further emails will be sent until the status of the build is changed.
Build log follows below:

[...truncated 2280 lines...]
[INFO] Tests run: 3, Failures: 0, Errors: 0, Skipped: 0, Time elapsed: 1.182 s - in org.apache.sling.launchpad.webapp.integrationtest.servlets.post.SlingAutoPropertiesTest
[INFO] Running org.apache.sling.launchpad.webapp.integrationtest.servlets.post.PostServletVersionableTest
[INFO] Tests run: 26, Failures: 0, Errors: 0, Skipped: 0, Time elapsed: 2.697 s - in org.apache.sling.launchpad.webapp.integrationtest.servlets.post.PostServletVersionableTest
[INFO] Running org.apache.sling.launchpad.webapp.integrationtest.servlets.post.PostResponseCreatorTest
[INFO] Tests run: 1, Failures: 0, Errors: 0, Skipped: 0, Time elapsed: 0.003 s - in org.apache.sling.launchpad.webapp.integrationtest.servlets.post.PostResponseCreatorTest
[INFO] Running org.apache.sling.launchpad.webapp.integrationtest.servlets.post.PostToRootTest
[INFO] Tests run: 1, Failures: 0, Errors: 0, Skipped: 0, Time elapsed: 0.013 s - in org.apache.sling.launchpad.webapp.integrationtest.servlets.post.PostToRootTest
[INFO] Running org.apache.sling.launchpad.webapp.integrationtest.servlets.post.PostServletPatchTest
[INFO] Tests run: 4, Failures: 0, Errors: 0, Skipped: 0, Time elapsed: 0.135 s - in org.apache.sling.launchpad.webapp.integrationtest.servlets.post.PostServletPatchTest
[INFO] Running org.apache.sling.launchpad.webapp.integrationtest.servlets.post.SlingPostProcessorTest
[INFO] Tests run: 1, Failures: 0, Errors: 0, Skipped: 0, Time elapsed: 0.022 s - in org.apache.sling.launchpad.webapp.integrationtest.servlets.post.SlingPostProcessorTest
[INFO] Running org.apache.sling.launchpad.webapp.integrationtest.servlets.post.PostServletOrderTest
[INFO] Tests run: 9, Failures: 0, Errors: 0, Skipped: 0, Time elapsed: 0.582 s - in org.apache.sling.launchpad.webapp.integrationtest.servlets.post.PostServletOrderTest
[INFO] Running org.apache.sling.launchpad.webapp.integrationtest.servlets.post.PostServletAtCopyTest
[INFO] Tests run: 10, Failures: 0, Errors: 0, Skipped: 0, Time elapsed: 0.467 s - in org.apache.sling.launchpad.webapp.integrationtest.servlets.post.PostServletAtCopyTest
[INFO] Running org.apache.sling.launchpad.webapp.integrationtest.servlets.post.PostServletPrivilegesUpdateTest
[WARNING] Tests run: 1, Failures: 0, Errors: 0, Skipped: 1, Time elapsed: 0.001 s - in org.apache.sling.launchpad.webapp.integrationtest.servlets.post.PostServletPrivilegesUpdateTest
[INFO] Running org.apache.sling.launchpad.webapp.integrationtest.servlets.post.PostServletUpdateTest
[INFO] Tests run: 7, Failures: 0, Errors: 0, Skipped: 0, Time elapsed: 0.269 s - in org.apache.sling.launchpad.webapp.integrationtest.servlets.post.PostServletUpdateTest
[INFO] Running org.apache.sling.launchpad.webapp.integrationtest.servlets.post.PostServletCreateTest
[INFO] Tests run: 16, Failures: 0, Errors: 0, Skipped: 0, Time elapsed: 0.371 s - in org.apache.sling.launchpad.webapp.integrationtest.servlets.post.PostServletCreateTest
[INFO] Running org.apache.sling.launchpad.webapp.integrationtest.servlets.post.SlingDefaultValuesTest
[INFO] Tests run: 5, Failures: 0, Errors: 0, Skipped: 0, Time elapsed: 0.272 s - in org.apache.sling.launchpad.webapp.integrationtest.servlets.post.SlingDefaultValuesTest
[INFO] Running org.apache.sling.launchpad.webapp.integrationtest.servlets.post.PostServletOutputContentTypeTest
[INFO] Tests run: 6, Failures: 0, Errors: 0, Skipped: 0, Time elapsed: 0.083 s - in org.apache.sling.launchpad.webapp.integrationtest.servlets.post.PostServletOutputContentTypeTest
[INFO] Running org.apache.sling.launchpad.webapp.integrationtest.servlets.post.PostServletMoveTest
[INFO] Tests run: 15, Failures: 0, Errors: 0, Skipped: 0, Time elapsed: 1.575 s - in org.apache.sling.launchpad.webapp.integrationtest.servlets.post.PostServletMoveTest
[INFO] Running org.apache.sling.launchpad.webapp.integrationtest.servlets.post.ReferenceTypeHintTest
[INFO] Tests run: 2, Failures: 0, Errors: 0, Skipped: 0, Time elapsed: 0.404 s - in org.apache.sling.launchpad.webapp.integrationtest.servlets.post.ReferenceTypeHintTest
[INFO] Running org.apache.sling.launchpad.webapp.integrationtest.servlets.post.PostServletDeleteTest
[INFO] Tests run: 5, Failures: 0, Errors: 0, Skipped: 0, Time elapsed: 0.759 s - in org.apache.sling.launchpad.webapp.integrationtest.servlets.post.PostServletDeleteTest
[INFO] Running org.apache.sling.launchpad.webapp.integrationtest.servlets.post.PostStatusTest
[INFO] Tests run: 4, Failures: 0, Errors: 0, Skipped: 0, Time elapsed: 0.034 s - in org.apache.sling.launchpad.webapp.integrationtest.servlets.post.PostStatusTest
[INFO] Running org.apache.sling.launchpad.webapp.integrationtest.servlets.post.PostServletAtMoveTest
[INFO] Tests run: 9, Failures: 0, Errors: 0, Skipped: 0, Time elapsed: 0.429 s - in org.apache.sling.launchpad.webapp.integrationtest.servlets.post.PostServletAtMoveTest
[INFO] Running org.apache.sling.launchpad.webapp.integrationtest.servlets.post.PostServletDeleteParentTest
[INFO] Tests run: 6, Failures: 0, Errors: 0, Skipped: 0, Time elapsed: 0.257 s - in org.apache.sling.launchpad.webapp.integrationtest.servlets.post.PostServletDeleteParentTest
[INFO] Running org.apache.sling.launchpad.webapp.integrationtest.servlets.R6WhiteboardServletTest
[INFO] Tests run: 1, Failures: 0, Errors: 0, Skipped: 0, Time elapsed: 0 s - in org.apache.sling.launchpad.webapp.integrationtest.servlets.R6WhiteboardServletTest
[INFO] Running org.apache.sling.launchpad.webapp.integrationtest.servlets.HeadServletTest
[INFO] Tests run: 6, Failures: 0, Errors: 0, Skipped: 0, Time elapsed: 0.033 s - in org.apache.sling.launchpad.webapp.integrationtest.servlets.HeadServletTest
[INFO] Running org.apache.sling.launchpad.webapp.integrationtest.servlets.resolver.errorhandler.ErrorHandlingTest
[INFO] Tests run: 10, Failures: 0, Errors: 0, Skipped: 0, Time elapsed: 3.864 s - in org.apache.sling.launchpad.webapp.integrationtest.servlets.resolver.errorhandler.ErrorHandlingTest
[INFO] Running org.apache.sling.launchpad.webapp.integrationtest.servlets.resolution.PathsServletTest
Aug 11, 2019 3:00:20 AM org.apache.sling.launchpad.testservices.servlets.TestServlet doGet
SEVERE: test JUL message
Aug 11, 2019 3:00:20 AM org.apache.sling.launchpad.testservices.servlets.TestServlet doGet
SEVERE: test JUL message
[INFO] Tests run: 2, Failures: 0, Errors: 0, Skipped: 0, Time elapsed: 0.231 s - in org.apache.sling.launchpad.webapp.integrationtest.servlets.resolution.PathsServletTest
[INFO] Running org.apache.sling.launchpad.webapp.integrationtest.servlets.resolution.RequestUriOptingServletTest
Aug 11, 2019 3:00:21 AM org.apache.sling.launchpad.testservices.servlets.TestServlet doGet
SEVERE: test JUL message
Aug 11, 2019 3:00:21 AM org.apache.sling.launchpad.testservices.servlets.TestServlet doGet
SEVERE: test JUL message
[INFO] Tests run: 4, Failures: 0, Errors: 0, Skipped: 0, Time elapsed: 0.467 s - in org.apache.sling.launchpad.webapp.integrationtest.servlets.resolution.RequestUriOptingServletTest
[INFO] Running org.apache.sling.launchpad.webapp.integrationtest.servlets.resolution.HtmlDefaultServletTest
Aug 11, 2019 3:00:24 AM org.apache.sling.launchpad.testservices.servlets.TestServlet doGet
SEVERE: test JUL message
[INFO] Tests run: 2, Failures: 0, Errors: 0, Skipped: 0, Time elapsed: 6.346 s - in org.apache.sling.launchpad.webapp.integrationtest.servlets.resolution.HtmlDefaultServletTest
[INFO] Running org.apache.sling.launchpad.webapp.integrationtest.servlets.resolution.PathsServletWithNodeTest
Aug 11, 2019 3:00:27 AM org.apache.sling.launchpad.testservices.servlets.TestServlet doGet
SEVERE: test JUL message
[INFO] Tests run: 1, Failures: 0, Errors: 0, Skipped: 0, Time elapsed: 0.126 s - in org.apache.sling.launchpad.webapp.integrationtest.servlets.resolution.PathsServletWithNodeTest
[INFO] Running org.apache.sling.launchpad.webapp.integrationtest.servlets.resolution.PrefixTest
Aug 11, 2019 3:00:28 AM org.apache.sling.launchpad.testservices.servlets.TestServlet doGet
SEVERE: test JUL message
Aug 11, 2019 3:00:28 AM org.apache.sling.launchpad.testservices.servlets.TestServlet doGet
SEVERE: test JUL message
Aug 11, 2019 3:00:28 AM org.apache.sling.launchpad.testservices.servlets.TestServlet doGet
SEVERE: test JUL message
[INFO] Tests run: 3, Failures: 0, Errors: 0, Skipped: 0, Time elapsed: 0.369 s - in org.apache.sling.launchpad.webapp.integrationtest.servlets.resolution.PrefixTest
[INFO] Running org.apache.sling.launchpad.webapp.integrationtest.servlets.resolution.ExtensionServletTest
Aug 11, 2019 3:00:28 AM org.apache.sling.launchpad.testservices.servlets.TestServlet doGet
SEVERE: test JUL message
Aug 11, 2019 3:00:28 AM org.apache.sling.launchpad.testservices.servlets.TestServlet doGet
SEVERE: test JUL message
[INFO] Tests run: 3, Failures: 0, Errors: 0, Skipped: 0, Time elapsed: 0.341 s - in org.apache.sling.launchpad.webapp.integrationtest.servlets.resolution.ExtensionServletTest
[INFO] Running org.apache.sling.launchpad.webapp.integrationtest.servlets.resolution.SelectorServletTest
Aug 11, 2019 3:00:28 AM org.apache.sling.launchpad.testservices.servlets.TestServlet doGet
SEVERE: test JUL message
Aug 11, 2019 3:00:28 AM org.apache.sling.launchpad.testservices.servlets.TestServlet doGet
SEVERE: test JUL message
[INFO] Tests run: 4, Failures: 0, Errors: 0, Skipped: 0, Time elapsed: 0.446 s - in org.apache.sling.launchpad.webapp.integrationtest.servlets.resolution.SelectorServletTest
[INFO] Running org.apache.sling.launchpad.webapp.integrationtest.servlets.resolution.PrioritiesTest
Aug 11, 2019 3:00:29 AM org.apache.sling.launchpad.testservices.servlets.TestServlet doGet
SEVERE: test JUL message
[INFO] Tests run: 1, Failures: 0, Errors: 0, Skipped: 0, Time elapsed: 0.11 s - in org.apache.sling.launchpad.webapp.integrationtest.servlets.resolution.PrioritiesTest
[INFO] Running org.apache.sling.launchpad.webapp.integrationtest.servlets.resolution.RequestObjectTest
Aug 11, 2019 3:00:29 AM org.apache.sling.launchpad.testservices.servlets.TestServlet doGet
SEVERE: test JUL message
Aug 11, 2019 3:00:29 AM org.apache.sling.launchpad.testservices.servlets.TestServlet doGet
SEVERE: test JUL message
Aug 11, 2019 3:00:29 AM org.apache.sling.launchpad.testservices.servlets.TestServlet doGet
SEVERE: test JUL message
Aug 11, 2019 3:00:29 AM org.apache.sling.launchpad.testservices.servlets.TestServlet doGet
SEVERE: test JUL message
[INFO] Tests run: 1, Failures: 0, Errors: 0, Skipped: 0, Time elapsed: 0.163 s - in org.apache.sling.launchpad.webapp.integrationtest.servlets.resolution.RequestObjectTest
[INFO] Running org.apache.sling.launchpad.webapp.integrationtest.servlets.resolution.PutMethodServletTest
[INFO] Tests run: 2, Failures: 0, Errors: 0, Skipped: 0, Time elapsed: 0.254 s - in org.apache.sling.launchpad.webapp.integrationtest.servlets.resolution.PutMethodServletTest
[INFO] Running org.apache.sling.launchpad.webapp.integrationtest.servlets.resolution.WarSelectorServletTest
[INFO] Tests run: 3, Failures: 0, Errors: 0, Skipped: 0, Time elapsed: 0.344 s - in org.apache.sling.launchpad.webapp.integrationtest.servlets.resolution.WarSelectorServletTest
[INFO] Running org.apache.sling.launchpad.webapp.integrationtest.ScriptBindingsValuesProviderTest
[INFO] Tests run: 3, Failures: 0, Errors: 0, Skipped: 0, Time elapsed: 0.492 s - in org.apache.sling.launchpad.webapp.integrationtest.ScriptBindingsValuesProviderTest
[INFO] Running org.apache.sling.launchpad.webapp.integrationtest.ImmediateScriptActivationTest
[INFO] Tests run: 2, Failures: 0, Errors: 0, Skipped: 0, Time elapsed: 1.682 s - in org.apache.sling.launchpad.webapp.integrationtest.ImmediateScriptActivationTest
[INFO] Running org.apache.sling.launchpad.webapp.integrationtest.FiltersTest
[INFO] Tests run: 1, Failures: 0, Errors: 0, Skipped: 0, Time elapsed: 0.001 s - in org.apache.sling.launchpad.webapp.integrationtest.FiltersTest
[INFO] Running org.apache.sling.launchpad.webapp.integrationtest.SyntheticResourceTest
[INFO] Tests run: 1, Failures: 0, Errors: 0, Skipped: 0, Time elapsed: 0.058 s - in org.apache.sling.launchpad.webapp.integrationtest.SyntheticResourceTest
[INFO] Running org.apache.sling.launchpad.webapp.integrationtest.GetStarTest
[INFO] Tests run: 2, Failures: 0, Errors: 0, Skipped: 0, Time elapsed: 0.05 s - in org.apache.sling.launchpad.webapp.integrationtest.GetStarTest
[INFO] Running org.apache.sling.launchpad.webapp.integrationtest.userManager.UpdateGroupTest
[INFO] Tests run: 8, Failures: 0, Errors: 0, Skipped: 0, Time elapsed: 1.129 s - in org.apache.sling.launchpad.webapp.integrationtest.userManager.UpdateGroupTest
[INFO] Running org.apache.sling.launchpad.webapp.integrationtest.userManager.CreateGroupTest
[INFO] Tests run: 8, Failures: 0, Errors: 0, Skipped: 0, Time elapsed: 0.33 s - in org.apache.sling.launchpad.webapp.integrationtest.userManager.CreateGroupTest
[INFO] Running org.apache.sling.launchpad.webapp.integrationtest.userManager.UserPrivilegesInfoTest
[INFO] Tests run: 7, Failures: 0, Errors: 0, Skipped: 0, Time elapsed: 1.691 s - in org.apache.sling.launchpad.webapp.integrationtest.userManager.UserPrivilegesInfoTest
[INFO] Running org.apache.sling.launchpad.webapp.integrationtest.userManager.CreateUserTest
[ERROR] Tests run: 11, Failures: 1, Errors: 0, Skipped: 0, Time elapsed: 0.352 s <<< FAILURE! - in org.apache.sling.launchpad.webapp.integrationtest.userManager.CreateUserTest
[ERROR] testAnonymousSelfRegistrationDisabled(org.apache.sling.launchpad.webapp.integrationtest.userManager.CreateUserTest)  Time elapsed: 0.016 s  <<< FAILURE!
junit.framework.AssertionFailedError: expected:<500> but was:<401>
        at org.apache.sling.launchpad.webapp.integrationtest.userManager.CreateUserTest.testAnonymousSelfRegistrationDisabled(CreateUserTest.java:271)

[INFO] Running org.apache.sling.launchpad.webapp.integrationtest.userManager.RemoveAuthorizablesTest
[INFO] Tests run: 11, Failures: 0, Errors: 0, Skipped: 0, Time elapsed: 0.762 s - in org.apache.sling.launchpad.webapp.integrationtest.userManager.RemoveAuthorizablesTest
[INFO] Running org.apache.sling.launchpad.webapp.integrationtest.userManager.UpdateUserTest
[INFO] Tests run: 12, Failures: 0, Errors: 0, Skipped: 0, Time elapsed: 0.814 s - in org.apache.sling.launchpad.webapp.integrationtest.userManager.UpdateUserTest
[INFO] Running org.apache.sling.launchpad.webapp.integrationtest.WebdavDeleteTest
[INFO] Tests run: 1, Failures: 0, Errors: 0, Skipped: 0, Time elapsed: 0.197 s - in org.apache.sling.launchpad.webapp.integrationtest.WebdavDeleteTest
[INFO] Running org.apache.sling.launchpad.webapp.integrationtest.GeneratedNodeNameTest
[INFO] Tests run: 6, Failures: 0, Errors: 0, Skipped: 0, Time elapsed: 0.182 s - in org.apache.sling.launchpad.webapp.integrationtest.GeneratedNodeNameTest
[INFO] Running org.apache.sling.launchpad.webapp.integrationtest.PropertyRenderingTest
[INFO] Tests run: 10, Failures: 0, Errors: 0, Skipped: 0, Time elapsed: 0.248 s - in org.apache.sling.launchpad.webapp.integrationtest.PropertyRenderingTest
[INFO] Running org.apache.sling.launchpad.webapp.integrationtest.FileUploadTest
[INFO] Tests run: 1, Failures: 0, Errors: 0, Skipped: 0, Time elapsed: 0.038 s - in org.apache.sling.launchpad.webapp.integrationtest.FileUploadTest
[INFO] Running org.apache.sling.launchpad.webapp.integrationtest.resourceprovider.PlanetsResourceProviderTest
[INFO] Tests run: 4, Failures: 0, Errors: 0, Skipped: 0, Time elapsed: 0.018 s - in org.apache.sling.launchpad.webapp.integrationtest.resourceprovider.PlanetsResourceProviderTest
[INFO] Running org.apache.sling.launchpad.webapp.integrationtest.ContentLoaderMiscPropertyTest
[INFO] Tests run: 1, Failures: 0, Errors: 0, Skipped: 0, Time elapsed: 0 s - in org.apache.sling.launchpad.webapp.integrationtest.ContentLoaderMiscPropertyTest
[INFO] Running org.apache.sling.launchpad.webapp.integrationtest.JspForwardTest
[INFO] Tests run: 6, Failures: 0, Errors: 0, Skipped: 0, Time elapsed: 1.923 s - in org.apache.sling.launchpad.webapp.integrationtest.JspForwardTest
[INFO] Running org.apache.sling.launchpad.webapp.integrationtest.JspIncludeTest
[INFO] Tests run: 9, Failures: 0, Errors: 0, Skipped: 0, Time elapsed: 5.969 s - in org.apache.sling.launchpad.webapp.integrationtest.JspIncludeTest
[INFO] Running org.apache.sling.launchpad.webapp.integrationtest.InitialContentTest
[INFO] Tests run: 5, Failures: 0, Errors: 0, Skipped: 0, Time elapsed: 0.019 s - in org.apache.sling.launchpad.webapp.integrationtest.InitialContentTest
[INFO] Running org.apache.sling.launchpad.webapp.integrationtest.JavascriptWrappersTest
[INFO] Tests run: 1, Failures: 0, Errors: 0, Skipped: 0, Time elapsed: 0.169 s - in org.apache.sling.launchpad.webapp.integrationtest.JavascriptWrappersTest
[INFO] Running org.apache.sling.launchpad.webapp.integrationtest.PostRedirectTest
[INFO] Tests run: 7, Failures: 0, Errors: 0, Skipped: 0, Time elapsed: 0.095 s - in org.apache.sling.launchpad.webapp.integrationtest.PostRedirectTest
[INFO] Running org.apache.sling.launchpad.webapp.integrationtest.BundleContentTest
[INFO] Tests run: 4, Failures: 0, Errors: 0, Skipped: 0, Time elapsed: 0.027 s - in org.apache.sling.launchpad.webapp.integrationtest.BundleContentTest
[INFO] Running org.apache.sling.launchpad.webapp.integrationtest.LaunchpadConfigInstallerTest
[INFO] Tests run: 1, Failures: 0, Errors: 0, Skipped: 0, Time elapsed: 0 s - in org.apache.sling.launchpad.webapp.integrationtest.LaunchpadConfigInstallerTest
[INFO] Running org.apache.sling.launchpad.webapp.integrationtest.jaxb.JaxbMarshallingTest
[INFO] Tests run: 1, Failures: 0, Errors: 0, Skipped: 0, Time elapsed: 0.294 s - in org.apache.sling.launchpad.webapp.integrationtest.jaxb.JaxbMarshallingTest
[INFO] Running org.apache.sling.launchpad.webapp.integrationtest.JsonRenderingTest
[INFO] Tests run: 17, Failures: 0, Errors: 0, Skipped: 0, Time elapsed: 0.819 s - in org.apache.sling.launchpad.webapp.integrationtest.JsonRenderingTest
[INFO] Running org.apache.sling.launchpad.webapp.integrationtest.runmodes.InactiveRunModeTest
[INFO] Tests run: 2, Failures: 0, Errors: 0, Skipped: 0, Time elapsed: 0.005 s - in org.apache.sling.launchpad.webapp.integrationtest.runmodes.InactiveRunModeTest
[INFO] Running org.apache.sling.launchpad.webapp.integrationtest.VersionParameterTest
[INFO] Tests run: 1, Failures: 0, Errors: 0, Skipped: 0, Time elapsed: 1.169 s - in org.apache.sling.launchpad.webapp.integrationtest.VersionParameterTest
[INFO] Running org.apache.sling.launchpad.webapp.integrationtest.ExportedPackagesTest
[INFO] Tests run: 3, Failures: 0, Errors: 0, Skipped: 0, Time elapsed: 0.01 s - in org.apache.sling.launchpad.webapp.integrationtest.ExportedPackagesTest
[INFO] Running org.apache.sling.launchpad.webapp.integrationtest.scripting.StandaloneScriptExecutionTest
[INFO] Tests run: 1, Failures: 0, Errors: 0, Skipped: 0, Time elapsed: 0.069 s - in org.apache.sling.launchpad.webapp.integrationtest.scripting.StandaloneScriptExecutionTest
[INFO] Running org.apache.sling.launchpad.webapp.integrationtest.scripting.htl.HtlTest
[INFO] Tests run: 3, Failures: 0, Errors: 0, Skipped: 0, Time elapsed: 1.35 s - in org.apache.sling.launchpad.webapp.integrationtest.scripting.htl.HtlTest
[INFO] Running org.apache.sling.launchpad.webapp.integrationtest.scripting.SlingJSPTaglibTest
[INFO] Tests run: 1, Failures: 0, Errors: 0, Skipped: 0, Time elapsed: 0.895 s - in org.apache.sling.launchpad.webapp.integrationtest.scripting.SlingJSPTaglibTest
[INFO] Running org.apache.sling.launchpad.webapp.integrationtest.NodetypeRenderingTest
[INFO] Tests run: 7, Failures: 0, Errors: 0, Skipped: 0, Time elapsed: 0.638 s - in org.apache.sling.launchpad.webapp.integrationtest.NodetypeRenderingTest
[INFO] Running org.apache.sling.launchpad.webapp.integrationtest.MkdirTest
[INFO] Tests run: 2, Failures: 0, Errors: 0, Skipped: 0, Time elapsed: 0.146 s - in org.apache.sling.launchpad.webapp.integrationtest.MkdirTest
[INFO]
[INFO] Results:
[INFO]
[ERROR] Failures:
[ERROR]   CreateUserTest.testAnonymousSelfRegistrationDisabled:271 expected:<500> but was:<401>
[INFO]
[ERROR] Tests run: 660, Failures: 1, Errors: 0, Skipped: 1
[INFO]
[INFO]
[INFO] --- slingstart-maven-plugin:1.7.16:stop (stop-container) @ org.apache.sling.launchpad.testing ---
[INFO] Stopping 1 Launchpad instances
[INFO] Stopping Launchpad '_-41000'
11.08.2019 03:00:52.667 *INFO * [Apache Sling Terminator] Java VM is shutting down
11.08.2019 03:00:52.668 *INFO * [Apache Sling Terminator] Stopping Apache Sling
Warning: Nashorn engine is planned to be removed from a future JDK release
11.08.2019 03:00:59.748 *INFO * [Sling Notifier] Apache Sling has been stopped
[INFO]
[INFO] --- ianal-maven-plugin:1.0-alpha-1:verify-legal-files (default) @ org.apache.sling.launchpad.testing ---
WARNING: An illegal reflective access operation has occurred
WARNING: Illegal reflective access by org.codehaus.groovy.reflection.CachedConstructor (file:/home/jenkins/.m2/repository/org/codehaus/groovy/groovy-all-minimal/1.5.6/groovy-all-minimal-1.5.6.jar) to constructor java.io.File(java.lang.String,java.io.File)
WARNING: Please consider reporting this to the maintainers of org.codehaus.groovy.reflection.CachedConstructor
WARNING: Use --illegal-access=warn to enable warnings of further illegal reflective access operations
WARNING: All illegal access operations will be denied in a future release
[INFO] Checking legal files in: org.apache.sling.launchpad.testing-12-SNAPSHOT.jar
[INFO] Checking legal files in: org.apache.sling.launchpad.testing-12-SNAPSHOT-sources.jar
[INFO]
[INFO] --- apache-rat-plugin:0.11:check (default) @ org.apache.sling.launchpad.testing ---
[INFO] 51 implicit excludes (use -debug for more details).
[INFO] Exclude: DEPENDENCIES
[INFO] Exclude: src/main/appended-resources/META-INF/*
[INFO] Exclude: velocity.log
[INFO] Exclude: target/*
[INFO] Exclude: README.md
[INFO] Exclude: maven-eclipse.xml
[INFO] Exclude: .*
[INFO] Exclude: .*/**
[INFO] Exclude: **/*.json
[INFO] Exclude: DEPENDENCIES
[INFO] Exclude: **/*.rej
[INFO] Exclude: hs_err_*.log
[INFO] Exclude: **/repository/index/*/index-details.txt
[INFO] Exclude: bnd.bnd
[INFO] 7 resources included (use -debug for more details)
[INFO] Rat check: Summary of files. Unapproved: 0 unknown: 0 generated: 0 approved: 6 licence.
[INFO]
[INFO] --- maven-failsafe-plugin:2.21.0:verify (default) @ org.apache.sling.launchpad.testing ---
[INFO] ------------------------------------------------------------------------
[INFO] BUILD FAILURE
[INFO] ------------------------------------------------------------------------
[INFO] Total time:  03:39 min
[INFO] Finished at: 2019-08-11T03:01:01Z
[INFO] ------------------------------------------------------------------------
[INFO] [jenkins-event-spy] Generated /home/jenkins/jenkins-slave/workspace/e-sling-launchpad-testing_master@tmp/withMaven073b37f6/maven-spy-20190811-025721-6915541983070989529912.log
[ERROR] Failed to execute goal org.apache.maven.plugins:maven-failsafe-plugin:2.21.0:verify (default) on project org.apache.sling.launchpad.testing: There are test failures.
[ERROR]
[ERROR] Please refer to /home/jenkins/jenkins-slave/workspace/e-sling-launchpad-testing_master/target/failsafe-reports for the individual test results.
[ERROR] Please refer to dump files (if any exist) [date]-jvmRun[N].dump, [date].dumpstream and [date]-jvmRun[N].dumpstream.
[ERROR] -> [Help 1]
[ERROR]
[ERROR] To see the full stack trace of the errors, re-run Maven with the -e switch.
[ERROR] Re-run Maven using the -X switch to enable full debug logging.
[ERROR]
[ERROR] For more information about the errors and possible solutions, please read the following articles:
[ERROR] [Help 1] http://cwiki.apache.org/confluence/display/MAVEN/MojoFailureException
[Pipeline] }
[withMaven] Publishers: Pipeline Graph Publisher: 6 ms, JGiven Publisher: 1 ms
[Pipeline] // withMaven
[Pipeline] }
[Pipeline] // stage
[Pipeline] }
[Pipeline] // timeout
[Pipeline] stage
[Pipeline] { (Notifications)
[Pipeline] echo
Status change is BROKEN, notifications will be sent.
[Pipeline] emailext
Reply | Threaded
Open this post in threaded view
|

[Jenkins] Sling » sling-org-apache-sling-launchpad-testing » master #269 is FIXED

Apache Jenkins Server-2
Please see https://builds.apache.org/job/Sling/job/sling-org-apache-sling-launchpad-testing/job/master/269/ for details.

No further emails will be sent until the status of the build is changed.