[Jenkins] Sling » sling-org-apache-sling-launchpad-testing » master #319 is BROKEN

classic Classic list List threaded Threaded
2 messages Options
Reply | Threaded
Open this post in threaded view
|

[Jenkins] Sling » sling-org-apache-sling-launchpad-testing » master #319 is BROKEN

Apache Jenkins Server-2
Please see https://builds.apache.org/job/Sling/job/sling-org-apache-sling-launchpad-testing/job/master/319/ for details.

No further emails will be sent until the status of the build is changed.
Build log follows below:

[...truncated 1357 lines...]
[INFO] Running org.apache.sling.launchpad.webapp.integrationtest.servlets.post.PostServletVersionableTest
[INFO] Tests run: 26, Failures: 0, Errors: 0, Skipped: 0, Time elapsed: 2.077 s - in org.apache.sling.launchpad.webapp.integrationtest.servlets.post.PostServletVersionableTest
[INFO] Running org.apache.sling.launchpad.webapp.integrationtest.servlets.post.PostServletImportTest
[INFO] Tests run: 19, Failures: 0, Errors: 0, Skipped: 0, Time elapsed: 1.324 s - in org.apache.sling.launchpad.webapp.integrationtest.servlets.post.PostServletImportTest
[INFO] Running org.apache.sling.launchpad.webapp.integrationtest.servlets.post.PostServletAtDeleteTest
[INFO] Tests run: 2, Failures: 0, Errors: 0, Skipped: 0, Time elapsed: 0.16 s - in org.apache.sling.launchpad.webapp.integrationtest.servlets.post.PostServletAtDeleteTest
[INFO] Running org.apache.sling.launchpad.webapp.integrationtest.servlets.resolution.WarSelectorServletTest
[INFO] Tests run: 3, Failures: 0, Errors: 0, Skipped: 0, Time elapsed: 0.307 s - in org.apache.sling.launchpad.webapp.integrationtest.servlets.resolution.WarSelectorServletTest
[INFO] Running org.apache.sling.launchpad.webapp.integrationtest.servlets.resolution.PathsServletTest
Sep 17, 2019 12:29:45 PM org.apache.sling.launchpad.testservices.servlets.TestServlet doGet
SEVERE: test JUL message
Sep 17, 2019 12:29:45 PM org.apache.sling.launchpad.testservices.servlets.TestServlet doGet
SEVERE: test JUL message
[INFO] Tests run: 2, Failures: 0, Errors: 0, Skipped: 0, Time elapsed: 0.242 s - in org.apache.sling.launchpad.webapp.integrationtest.servlets.resolution.PathsServletTest
[INFO] Running org.apache.sling.launchpad.webapp.integrationtest.servlets.resolution.PrefixTest
Sep 17, 2019 12:29:45 PM org.apache.sling.launchpad.testservices.servlets.TestServlet doGet
SEVERE: test JUL message
Sep 17, 2019 12:29:46 PM org.apache.sling.launchpad.testservices.servlets.TestServlet doGet
SEVERE: test JUL message
Sep 17, 2019 12:29:46 PM org.apache.sling.launchpad.testservices.servlets.TestServlet doGet
SEVERE: test JUL message
[INFO] Tests run: 3, Failures: 0, Errors: 0, Skipped: 0, Time elapsed: 0.299 s - in org.apache.sling.launchpad.webapp.integrationtest.servlets.resolution.PrefixTest
[INFO] Running org.apache.sling.launchpad.webapp.integrationtest.servlets.resolution.ExtensionServletTest
Sep 17, 2019 12:29:46 PM org.apache.sling.launchpad.testservices.servlets.TestServlet doGet
SEVERE: test JUL message
Sep 17, 2019 12:29:46 PM org.apache.sling.launchpad.testservices.servlets.TestServlet doGet
SEVERE: test JUL message
[INFO] Tests run: 3, Failures: 0, Errors: 0, Skipped: 0, Time elapsed: 0.3 s - in org.apache.sling.launchpad.webapp.integrationtest.servlets.resolution.ExtensionServletTest
[INFO] Running org.apache.sling.launchpad.webapp.integrationtest.servlets.resolution.PutMethodServletTest
[INFO] Tests run: 2, Failures: 0, Errors: 0, Skipped: 0, Time elapsed: 0.216 s - in org.apache.sling.launchpad.webapp.integrationtest.servlets.resolution.PutMethodServletTest
[INFO] Running org.apache.sling.launchpad.webapp.integrationtest.servlets.resolution.SelectorServletTest
Sep 17, 2019 12:29:46 PM org.apache.sling.launchpad.testservices.servlets.TestServlet doGet
SEVERE: test JUL message
Sep 17, 2019 12:29:47 PM org.apache.sling.launchpad.testservices.servlets.TestServlet doGet
SEVERE: test JUL message
[INFO] Tests run: 4, Failures: 0, Errors: 0, Skipped: 0, Time elapsed: 0.416 s - in org.apache.sling.launchpad.webapp.integrationtest.servlets.resolution.SelectorServletTest
[INFO] Running org.apache.sling.launchpad.webapp.integrationtest.servlets.resolution.RequestUriOptingServletTest
Sep 17, 2019 12:29:47 PM org.apache.sling.launchpad.testservices.servlets.TestServlet doGet
SEVERE: test JUL message
Sep 17, 2019 12:29:47 PM org.apache.sling.launchpad.testservices.servlets.TestServlet doGet
SEVERE: test JUL message
[INFO] Tests run: 4, Failures: 0, Errors: 0, Skipped: 0, Time elapsed: 0.492 s - in org.apache.sling.launchpad.webapp.integrationtest.servlets.resolution.RequestUriOptingServletTest
[INFO] Running org.apache.sling.launchpad.webapp.integrationtest.servlets.resolution.HtmlDefaultServletTest
Sep 17, 2019 12:29:50 PM org.apache.sling.launchpad.testservices.servlets.TestServlet doGet
SEVERE: test JUL message
[INFO] Tests run: 2, Failures: 0, Errors: 0, Skipped: 0, Time elapsed: 6.317 s - in org.apache.sling.launchpad.webapp.integrationtest.servlets.resolution.HtmlDefaultServletTest
[INFO] Running org.apache.sling.launchpad.webapp.integrationtest.servlets.resolution.PathsServletWithNodeTest
Sep 17, 2019 12:29:54 PM org.apache.sling.launchpad.testservices.servlets.TestServlet doGet
SEVERE: test JUL message
[INFO] Tests run: 1, Failures: 0, Errors: 0, Skipped: 0, Time elapsed: 0.138 s - in org.apache.sling.launchpad.webapp.integrationtest.servlets.resolution.PathsServletWithNodeTest
[INFO] Running org.apache.sling.launchpad.webapp.integrationtest.servlets.resolution.RequestObjectTest
Sep 17, 2019 12:29:54 PM org.apache.sling.launchpad.testservices.servlets.TestServlet doGet
SEVERE: test JUL message
Sep 17, 2019 12:29:54 PM org.apache.sling.launchpad.testservices.servlets.TestServlet doGet
SEVERE: test JUL message
Sep 17, 2019 12:29:54 PM org.apache.sling.launchpad.testservices.servlets.TestServlet doGet
SEVERE: test JUL message
Sep 17, 2019 12:29:54 PM org.apache.sling.launchpad.testservices.servlets.TestServlet doGet
SEVERE: test JUL message
[INFO] Tests run: 1, Failures: 0, Errors: 0, Skipped: 0, Time elapsed: 0.128 s - in org.apache.sling.launchpad.webapp.integrationtest.servlets.resolution.RequestObjectTest
[INFO] Running org.apache.sling.launchpad.webapp.integrationtest.servlets.resolution.PrioritiesTest
Sep 17, 2019 12:29:54 PM org.apache.sling.launchpad.testservices.servlets.TestServlet doGet
SEVERE: test JUL message
[INFO] Tests run: 1, Failures: 0, Errors: 0, Skipped: 0, Time elapsed: 0.114 s - in org.apache.sling.launchpad.webapp.integrationtest.servlets.resolution.PrioritiesTest
[INFO] Running org.apache.sling.launchpad.webapp.integrationtest.servlets.resolver.errorhandler.ErrorHandlingTest
[INFO] Tests run: 10, Failures: 0, Errors: 0, Skipped: 0, Time elapsed: 3.136 s - in org.apache.sling.launchpad.webapp.integrationtest.servlets.resolver.errorhandler.ErrorHandlingTest
[INFO] Running org.apache.sling.launchpad.webapp.integrationtest.servlets.HeadServletTest
[INFO] Tests run: 6, Failures: 0, Errors: 0, Skipped: 0, Time elapsed: 0.038 s - in org.apache.sling.launchpad.webapp.integrationtest.servlets.HeadServletTest
[INFO] Running org.apache.sling.launchpad.webapp.integrationtest.servlets.R6WhiteboardServletTest
[INFO] Tests run: 1, Failures: 0, Errors: 0, Skipped: 0, Time elapsed: 0 s - in org.apache.sling.launchpad.webapp.integrationtest.servlets.R6WhiteboardServletTest
[INFO] Running org.apache.sling.launchpad.webapp.integrationtest.ScriptBuiltinObjectsTest
[INFO] Tests run: 1, Failures: 0, Errors: 0, Skipped: 0, Time elapsed: 0.104 s - in org.apache.sling.launchpad.webapp.integrationtest.ScriptBuiltinObjectsTest
[INFO] Running org.apache.sling.launchpad.webapp.integrationtest.WriteableResourcesProxyTest
[INFO] Tests run: 1, Failures: 0, Errors: 0, Skipped: 0, Time elapsed: 0.018 s - in org.apache.sling.launchpad.webapp.integrationtest.WriteableResourcesProxyTest
[INFO] Running org.apache.sling.launchpad.webapp.integrationtest.ValueFromTest
[INFO] Tests run: 3, Failures: 0, Errors: 0, Skipped: 0, Time elapsed: 0.056 s - in org.apache.sling.launchpad.webapp.integrationtest.ValueFromTest
[INFO] Running org.apache.sling.launchpad.webapp.integrationtest.LaunchpadConfigInstallerTest
[INFO] Tests run: 1, Failures: 0, Errors: 0, Skipped: 0, Time elapsed: 0.002 s - in org.apache.sling.launchpad.webapp.integrationtest.LaunchpadConfigInstallerTest
[INFO] Running org.apache.sling.launchpad.webapp.integrationtest.GetStarTest
[INFO] Tests run: 2, Failures: 0, Errors: 0, Skipped: 0, Time elapsed: 0.046 s - in org.apache.sling.launchpad.webapp.integrationtest.GetStarTest
[INFO] Running org.apache.sling.launchpad.webapp.integrationtest.jaxb.JaxbMarshallingTest
[INFO] Tests run: 1, Failures: 0, Errors: 0, Skipped: 0, Time elapsed: 0.207 s - in org.apache.sling.launchpad.webapp.integrationtest.jaxb.JaxbMarshallingTest
[INFO] Running org.apache.sling.launchpad.webapp.integrationtest.DavExDisabledAnonAccessTest
[INFO] Tests run: 2, Failures: 0, Errors: 0, Skipped: 0, Time elapsed: 0.655 s - in org.apache.sling.launchpad.webapp.integrationtest.DavExDisabledAnonAccessTest
[INFO] Running org.apache.sling.launchpad.webapp.integrationtest.CreateNodeTest
[INFO] Tests run: 6, Failures: 0, Errors: 0, Skipped: 0, Time elapsed: 0.186 s - in org.apache.sling.launchpad.webapp.integrationtest.CreateNodeTest
[INFO] Running org.apache.sling.launchpad.webapp.integrationtest.ImmediateScriptActivationTest
[INFO] Tests run: 2, Failures: 0, Errors: 0, Skipped: 0, Time elapsed: 1.997 s - in org.apache.sling.launchpad.webapp.integrationtest.ImmediateScriptActivationTest
[INFO] Running org.apache.sling.launchpad.webapp.integrationtest.RangeStreamingTest
[INFO] Tests run: 4, Failures: 0, Errors: 0, Skipped: 0, Time elapsed: 0.337 s - in org.apache.sling.launchpad.webapp.integrationtest.RangeStreamingTest
[INFO] Running org.apache.sling.launchpad.webapp.integrationtest.UploadFileTest
[INFO] Tests run: 4, Failures: 0, Errors: 0, Skipped: 0, Time elapsed: 0.206 s - in org.apache.sling.launchpad.webapp.integrationtest.UploadFileTest
[INFO] Running org.apache.sling.launchpad.webapp.integrationtest.userManager.UpdateUserTest
[INFO] Tests run: 12, Failures: 0, Errors: 0, Skipped: 0, Time elapsed: 0.866 s - in org.apache.sling.launchpad.webapp.integrationtest.userManager.UpdateUserTest
[INFO] Running org.apache.sling.launchpad.webapp.integrationtest.userManager.RemoveAuthorizablesTest
[INFO] Tests run: 11, Failures: 0, Errors: 0, Skipped: 0, Time elapsed: 0.711 s - in org.apache.sling.launchpad.webapp.integrationtest.userManager.RemoveAuthorizablesTest
[INFO] Running org.apache.sling.launchpad.webapp.integrationtest.userManager.UserPrivilegesInfoTest
[INFO] Tests run: 7, Failures: 0, Errors: 0, Skipped: 0, Time elapsed: 1.6 s - in org.apache.sling.launchpad.webapp.integrationtest.userManager.UserPrivilegesInfoTest
[INFO] Running org.apache.sling.launchpad.webapp.integrationtest.userManager.UpdateGroupTest
[INFO] Tests run: 8, Failures: 0, Errors: 0, Skipped: 0, Time elapsed: 1.07 s - in org.apache.sling.launchpad.webapp.integrationtest.userManager.UpdateGroupTest
[INFO] Running org.apache.sling.launchpad.webapp.integrationtest.userManager.CreateUserTest
[INFO] Tests run: 11, Failures: 0, Errors: 0, Skipped: 0, Time elapsed: 0.401 s - in org.apache.sling.launchpad.webapp.integrationtest.userManager.CreateUserTest
[INFO] Running org.apache.sling.launchpad.webapp.integrationtest.userManager.CreateGroupTest
[INFO] Tests run: 8, Failures: 0, Errors: 0, Skipped: 0, Time elapsed: 0.368 s - in org.apache.sling.launchpad.webapp.integrationtest.userManager.CreateGroupTest
[INFO] Running org.apache.sling.launchpad.webapp.integrationtest.ServletResolverConfigTest
[INFO] Tests run: 1, Failures: 0, Errors: 0, Skipped: 0, Time elapsed: 0.003 s - in org.apache.sling.launchpad.webapp.integrationtest.ServletResolverConfigTest
[INFO] Running org.apache.sling.launchpad.webapp.integrationtest.accessManager.GetAclTest
[INFO] Tests run: 7, Failures: 0, Errors: 0, Skipped: 0, Time elapsed: 0.998 s - in org.apache.sling.launchpad.webapp.integrationtest.accessManager.GetAclTest
[INFO] Running org.apache.sling.launchpad.webapp.integrationtest.accessManager.AccessPrivilegesInfoTest
[INFO] Tests run: 7, Failures: 0, Errors: 0, Skipped: 0, Time elapsed: 1.44 s - in org.apache.sling.launchpad.webapp.integrationtest.accessManager.AccessPrivilegesInfoTest
[INFO] Running org.apache.sling.launchpad.webapp.integrationtest.accessManager.ModifyAceTest
[INFO] Tests run: 20, Failures: 0, Errors: 0, Skipped: 0, Time elapsed: 2.48 s - in org.apache.sling.launchpad.webapp.integrationtest.accessManager.ModifyAceTest
[INFO] Running org.apache.sling.launchpad.webapp.integrationtest.accessManager.RemoveAcesTest
[INFO] Tests run: 4, Failures: 0, Errors: 0, Skipped: 0, Time elapsed: 0.477 s - in org.apache.sling.launchpad.webapp.integrationtest.accessManager.RemoveAcesTest
[INFO] Running org.apache.sling.launchpad.webapp.integrationtest.issues.SLING2085Test
[INFO] Tests run: 1, Failures: 0, Errors: 0, Skipped: 0, Time elapsed: 0.013 s - in org.apache.sling.launchpad.webapp.integrationtest.issues.SLING2085Test
[INFO] Running org.apache.sling.launchpad.webapp.integrationtest.issues.SLING2522Test
[INFO] Tests run: 1, Failures: 0, Errors: 0, Skipped: 0, Time elapsed: 0.002 s - in org.apache.sling.launchpad.webapp.integrationtest.issues.SLING2522Test
[INFO] Running org.apache.sling.launchpad.webapp.integrationtest.issues.SLING2617Test
[INFO] Tests run: 1, Failures: 0, Errors: 0, Skipped: 0, Time elapsed: 0.148 s - in org.apache.sling.launchpad.webapp.integrationtest.issues.SLING2617Test
[INFO] Running org.apache.sling.launchpad.webapp.integrationtest.issues.SLING457Test
[INFO] Tests run: 2, Failures: 0, Errors: 0, Skipped: 0, Time elapsed: 0.363 s - in org.apache.sling.launchpad.webapp.integrationtest.issues.SLING457Test
[INFO] Running org.apache.sling.launchpad.webapp.integrationtest.issues.SLING2082Test
[INFO] Tests run: 2, Failures: 0, Errors: 0, Skipped: 0, Time elapsed: 0.001 s - in org.apache.sling.launchpad.webapp.integrationtest.issues.SLING2082Test
[INFO] Running org.apache.sling.launchpad.webapp.integrationtest.issues.SLING2094Test
[INFO] Tests run: 2, Failures: 0, Errors: 0, Skipped: 0, Time elapsed: 0.267 s - in org.apache.sling.launchpad.webapp.integrationtest.issues.SLING2094Test
[INFO] Running org.apache.sling.launchpad.webapp.integrationtest.issues.SLING760Test
[INFO] Tests run: 1, Failures: 0, Errors: 0, Skipped: 0, Time elapsed: 0.098 s - in org.apache.sling.launchpad.webapp.integrationtest.issues.SLING760Test
[INFO] Running org.apache.sling.launchpad.webapp.integrationtest.runmodes.InactiveRunModeTest
[INFO] Tests run: 2, Failures: 0, Errors: 0, Skipped: 0, Time elapsed: 0.014 s - in org.apache.sling.launchpad.webapp.integrationtest.runmodes.InactiveRunModeTest
[INFO] Running org.apache.sling.launchpad.webapp.integrationtest.resourceprovider.PlanetsResourceProviderTest
[INFO] Tests run: 4, Failures: 0, Errors: 0, Skipped: 0, Time elapsed: 0.036 s - in org.apache.sling.launchpad.webapp.integrationtest.resourceprovider.PlanetsResourceProviderTest
[INFO] Running org.apache.sling.launchpad.webapp.integrationtest.RedirectTest
[INFO] Tests run: 6, Failures: 0, Errors: 0, Skipped: 0, Time elapsed: 0.196 s - in org.apache.sling.launchpad.webapp.integrationtest.RedirectTest
[INFO]
[INFO] Results:
[INFO]
[ERROR] Failures:
[ERROR]   DomTest.testDomExecutionIsSuccessful:34->HttpTestBase.getContent:419->HttpTestBase.getContent:424->HttpTestBase.getContent:432->HttpTestBase.getContent:457 Expected status 200 for http://localhost:41000/bin/dom.xml (content=<html>
<head>
<meta http-equiv="Content-Type" content="text/html;charset=utf-8"/>
<title>Error 503 ServletResolver service missing, cannot service requests</title>
</head>
<body><h2>HTTP ERROR 503</h2>
<p>Problem accessing /bin/dom.xml. Reason:
<pre>    ServletResolver service missing, cannot service requests</pre></p>
</body>
</html>
) expected:<200> but was:<503>
[ERROR]   SaxTest.testSaxExecutionIsSuccessful:33->HttpTestBase.getContent:419->HttpTestBase.getContent:424->HttpTestBase.getContent:432->HttpTestBase.getContent:457 Expected status 200 for http://localhost:41000/bin/sax.xml (content=<html>
<head>
<meta http-equiv="Content-Type" content="text/html;charset=utf-8"/>
<title>Error 503 ServletResolver service missing, cannot service requests</title>
</head>
<body><h2>HTTP ERROR 503</h2>
<p>Problem accessing /bin/sax.xml. Reason:
<pre>    ServletResolver service missing, cannot service requests</pre></p>
</body>
</html>
) expected:<200> but was:<503>
[ERROR]   XPathTest.testXPathEvaluationIsApplied:34->HttpTestBase.getContent:419->HttpTestBase.getContent:424->HttpTestBase.getContent:432->HttpTestBase.getContent:457 Expected status 200 for http://localhost:41000/bin/xpath.xml (content=<html>
<head>
<meta http-equiv="Content-Type" content="text/html;charset=utf-8"/>
<title>Error 503 ServletResolver service missing, cannot service requests</title>
</head>
<body><h2>HTTP ERROR 503</h2>
<p>Problem accessing /bin/xpath.xml. Reason:
<pre>    ServletResolver service missing, cannot service requests</pre></p>
</body>
</html>
) expected:<200> but was:<503>
[ERROR] Errors:
[ERROR]   GetWithSuffixTest.setUp:42 » HttpStatusCode Expected status code 302 for POST,...
[ERROR]   GetWithSuffixTest.setUp:42 » HttpStatusCode Expected status code 302 for POST,...
[ERROR]   GetWithSuffixTest.setUp:42 » HttpStatusCode Expected status code 302 for POST,...
[ERROR]   GetWithSuffixTest.setUp:42 » HttpStatusCode Expected status code 302 for POST,...
[ERROR]   CrudTest.setUp:36 » IO mkdir(http://localhost:41000/apps) failed, status code=...
[INFO]
[ERROR] Tests run: 660, Failures: 3, Errors: 5, Skipped: 1
[INFO]
[INFO]
[INFO] --- slingstart-maven-plugin:1.7.16:stop (stop-container) @ org.apache.sling.launchpad.testing ---
[INFO] Stopping 1 Launchpad instances
[INFO] Stopping Launchpad '_-41000'
17.09.2019 12:30:13.855 *INFO * [Apache Sling Terminator] Java VM is shutting down
17.09.2019 12:30:13.856 *INFO * [Apache Sling Terminator] Stopping Apache Sling
Warning: Nashorn engine is planned to be removed from a future JDK release
Warning: Nashorn engine is planned to be removed from a future JDK release
17.09.2019 12:30:15.436 *INFO * [Sling Notifier] Apache Sling has been stopped
[INFO]
[INFO] --- ianal-maven-plugin:1.0-alpha-1:verify-legal-files (default) @ org.apache.sling.launchpad.testing ---
WARNING: An illegal reflective access operation has occurred
WARNING: Illegal reflective access by org.codehaus.groovy.reflection.CachedConstructor (file:/home/jenkins/.m2/repository/org/codehaus/groovy/groovy-all-minimal/1.5.6/groovy-all-minimal-1.5.6.jar) to constructor java.io.File(java.lang.String,java.io.File)
WARNING: Please consider reporting this to the maintainers of org.codehaus.groovy.reflection.CachedConstructor
WARNING: Use --illegal-access=warn to enable warnings of further illegal reflective access operations
WARNING: All illegal access operations will be denied in a future release
[INFO] Checking legal files in: org.apache.sling.launchpad.testing-12-SNAPSHOT.jar
[INFO] Checking legal files in: org.apache.sling.launchpad.testing-12-SNAPSHOT-sources.jar
[INFO]
[INFO] --- apache-rat-plugin:0.11:check (default) @ org.apache.sling.launchpad.testing ---
[INFO] 51 implicit excludes (use -debug for more details).
[INFO] Exclude: DEPENDENCIES
[INFO] Exclude: src/main/appended-resources/META-INF/*
[INFO] Exclude: velocity.log
[INFO] Exclude: target/*
[INFO] Exclude: README.md
[INFO] Exclude: maven-eclipse.xml
[INFO] Exclude: .*
[INFO] Exclude: .*/**
[INFO] Exclude: **/*.json
[INFO] Exclude: DEPENDENCIES
[INFO] Exclude: **/*.rej
[INFO] Exclude: hs_err_*.log
[INFO] Exclude: **/repository/index/*/index-details.txt
[INFO] Exclude: bnd.bnd
[INFO] 7 resources included (use -debug for more details)
[INFO] Rat check: Summary of files. Unapproved: 0 unknown: 0 generated: 0 approved: 6 licence.
[INFO]
[INFO] --- maven-failsafe-plugin:2.21.0:verify (default) @ org.apache.sling.launchpad.testing ---
[INFO] ------------------------------------------------------------------------
[INFO] BUILD FAILURE
[INFO] ------------------------------------------------------------------------
[INFO] Total time:  03:22 min
[INFO] Finished at: 2019-09-17T12:30:16Z
[INFO] ------------------------------------------------------------------------
[INFO] [jenkins-event-spy] Generated /home/jenkins/jenkins-slave/workspace/e-sling-launchpad-testing_master@tmp/withMaven4fbcc4b8/maven-spy-20190917-122653-7451041378909224601938.log
[ERROR] Failed to execute goal org.apache.maven.plugins:maven-failsafe-plugin:2.21.0:verify (default) on project org.apache.sling.launchpad.testing: There are test failures.
[ERROR]
[ERROR] Please refer to /home/jenkins/jenkins-slave/workspace/e-sling-launchpad-testing_master/target/failsafe-reports for the individual test results.
[ERROR] Please refer to dump files (if any exist) [date]-jvmRun[N].dump, [date].dumpstream and [date]-jvmRun[N].dumpstream.
[ERROR] -> [Help 1]
[ERROR]
[ERROR] To see the full stack trace of the errors, re-run Maven with the -e switch.
[ERROR] Re-run Maven using the -X switch to enable full debug logging.
[ERROR]
[ERROR] For more information about the errors and possible solutions, please read the following articles:
[ERROR] [Help 1] http://cwiki.apache.org/confluence/display/MAVEN/MojoFailureException
[Pipeline] }
[withMaven] Publishers: Pipeline Graph Publisher: 25 ms, JGiven Publisher: 2 ms
[Pipeline] // withMaven
[Pipeline] }
[Pipeline] // stage
[Pipeline] }
[Pipeline] // timeout
[Pipeline] stage
[Pipeline] { (Notifications)
[Pipeline] echo
Status change is BROKEN, notifications will be sent.
[Pipeline] emailext
Reply | Threaded
Open this post in threaded view
|

[Jenkins] Sling » sling-org-apache-sling-launchpad-testing » master #320 is FIXED

Apache Jenkins Server-2
Please see https://builds.apache.org/job/Sling/job/sling-org-apache-sling-launchpad-testing/job/master/320/ for details.

No further emails will be sent until the status of the build is changed.