[jira] [Created] (SLING-6957) Failing tests when updating version of

classic Classic list List threaded Threaded
1 message Options
Reply | Threaded
Open this post in threaded view
|

[jira] [Created] (SLING-6957) Failing tests when updating version of

JIRA jira@apache.org
angela created SLING-6957:
-----------------------------

             Summary: Failing tests when updating version of
                 Key: SLING-6957
                 URL: https://issues.apache.org/jira/browse/SLING-6957
             Project: Sling
          Issue Type: Bug
          Components: JCR
            Reporter: angela


when updating the version of {{org.apache.sling.serviceusermapper}} from _1.0.0_ to _1.3.2_ within the pom.xml of {{org.apache.sling.jcr.base}}, the build of this module fails the following tests:

{code}
Running org.apache.sling.jcr.base.RepositoryInitializersTest
Tests run: 4, Failures: 0, Errors: 4, Skipped: 0, Time elapsed: 0.155 sec <<< FAILURE! - in org.apache.sling.jcr.base.RepositoryInitializersTest
inOrderInitializers(org.apache.sling.jcr.base.RepositoryInitializersTest)  Time elapsed: 0.121 sec  <<< ERROR!
java.lang.RuntimeException: Unable to initialize JCR_MOCK resource resolver factory: No matching activation method with name 'configure'  found in class org.apache.sling.serviceusermapping.impl.ServiceUserMapperImpl
        at org.apache.sling.testing.mock.sling.context.ContextResourceResolverFactory.get(ContextResourceResolverFactory.java:69)
        at org.apache.sling.testing.mock.sling.context.SlingContextImpl.newResourceResolverFactory(SlingContextImpl.java:107)
        at org.apache.sling.testing.mock.sling.context.SlingContextImpl.setUp(SlingContextImpl.java:98)
        at org.apache.sling.testing.mock.sling.junit.SlingContext.access$000(SlingContext.java:32)
        at org.apache.sling.testing.mock.sling.junit.SlingContext$1.before(SlingContext.java:113)
        at org.junit.rules.ExternalResource$1.evaluate(ExternalResource.java:46)
        at org.junit.rules.RunRules.evaluate(RunRules.java:20)
        at org.junit.runners.ParentRunner.runLeaf(ParentRunner.java:325)
        at org.junit.runners.BlockJUnit4ClassRunner.runChild(BlockJUnit4ClassRunner.java:78)
        at org.junit.runners.BlockJUnit4ClassRunner.runChild(BlockJUnit4ClassRunner.java:57)
        at org.junit.runners.ParentRunner$3.run(ParentRunner.java:290)
        at org.junit.runners.ParentRunner$1.schedule(ParentRunner.java:71)
        at org.junit.runners.ParentRunner.runChildren(ParentRunner.java:288)
        at org.junit.runners.ParentRunner.access$000(ParentRunner.java:58)
        at org.junit.runners.ParentRunner$2.evaluate(ParentRunner.java:268)
        at org.junit.runners.ParentRunner.run(ParentRunner.java:363)
        at org.apache.maven.surefire.junit4.JUnit4Provider.execute(JUnit4Provider.java:283)
        at org.apache.maven.surefire.junit4.JUnit4Provider.executeWithRerun(JUnit4Provider.java:173)
        at org.apache.maven.surefire.junit4.JUnit4Provider.executeTestSet(JUnit4Provider.java:153)
        at org.apache.maven.surefire.junit4.JUnit4Provider.invoke(JUnit4Provider.java:128)
        at org.apache.maven.surefire.booter.ForkedBooter.invokeProviderInSameClassLoader(ForkedBooter.java:203)
        at org.apache.maven.surefire.booter.ForkedBooter.runSuitesInProcess(ForkedBooter.java:155)
        at org.apache.maven.surefire.booter.ForkedBooter.main(ForkedBooter.java:103)
Caused by: java.lang.RuntimeException: No matching activation method with name 'configure'  found in class org.apache.sling.serviceusermapping.impl.ServiceUserMapperImpl
        at org.apache.sling.testing.mock.osgi.OsgiServiceUtil.activateDeactivate(OsgiServiceUtil.java:157)
        at org.apache.sling.testing.mock.osgi.MockOsgi.activate(MockOsgi.java:190)
        at org.apache.sling.testing.mock.sling.ResourceResolverFactoryInitializer.registerServiceIfNotPresent(ResourceResolverFactoryInitializer.java:160)
        at org.apache.sling.testing.mock.sling.ResourceResolverFactoryInitializer.ensureResourceResolverFactoryActivatorDependencies(ResourceResolverFactoryInitializer.java:117)
        at org.apache.sling.testing.mock.sling.ResourceResolverFactoryInitializer.setUp(ResourceResolverFactoryInitializer.java:74)
        at org.apache.sling.testing.mock.sling.MockSling.newResourceResolverFactory(MockSling.java:88)
        at org.apache.sling.testing.mock.sling.context.ContextResourceResolverFactory.get(ContextResourceResolverFactory.java:45)
        at org.apache.sling.testing.mock.sling.context.SlingContextImpl.newResourceResolverFactory(SlingContextImpl.java:107)
        at org.apache.sling.testing.mock.sling.context.SlingContextImpl.setUp(SlingContextImpl.java:98)
        at org.apache.sling.testing.mock.sling.junit.SlingContext.access$000(SlingContext.java:32)
        at org.apache.sling.testing.mock.sling.junit.SlingContext$1.before(SlingContext.java:113)
        at org.junit.rules.ExternalResource$1.evaluate(ExternalResource.java:46)
        at org.junit.rules.RunRules.evaluate(RunRules.java:20)
        at org.junit.runners.ParentRunner.runLeaf(ParentRunner.java:325)
        at org.junit.runners.BlockJUnit4ClassRunner.runChild(BlockJUnit4ClassRunner.java:78)
        at org.junit.runners.BlockJUnit4ClassRunner.runChild(BlockJUnit4ClassRunner.java:57)
        at org.junit.runners.ParentRunner$3.run(ParentRunner.java:290)
        at org.junit.runners.ParentRunner$1.schedule(ParentRunner.java:71)
        at org.junit.runners.ParentRunner.runChildren(ParentRunner.java:288)
        at org.junit.runners.ParentRunner.access$000(ParentRunner.java:58)
        at org.junit.runners.ParentRunner$2.evaluate(ParentRunner.java:268)
        at org.junit.runners.ParentRunner.run(ParentRunner.java:363)
        at org.apache.maven.surefire.junit4.JUnit4Provider.execute(JUnit4Provider.java:283)
        at org.apache.maven.surefire.junit4.JUnit4Provider.executeWithRerun(JUnit4Provider.java:173)
        at org.apache.maven.surefire.junit4.JUnit4Provider.executeTestSet(JUnit4Provider.java:153)
        at org.apache.maven.surefire.junit4.JUnit4Provider.invoke(JUnit4Provider.java:128)
        at org.apache.maven.surefire.booter.ForkedBooter.invokeProviderInSameClassLoader(ForkedBooter.java:203)
        at org.apache.maven.surefire.booter.ForkedBooter.runSuitesInProcess(ForkedBooter.java:155)
        at org.apache.maven.surefire.booter.ForkedBooter.main(ForkedBooter.java:103)

noRepositoryOnError(org.apache.sling.jcr.base.RepositoryInitializersTest)  Time elapsed: 0.013 sec  <<< ERROR!
java.lang.RuntimeException: Unable to initialize JCR_MOCK resource resolver factory: No matching activation method with name 'configure'  found in class org.apache.sling.serviceusermapping.impl.ServiceUserMapperImpl
        at org.apache.sling.testing.mock.sling.context.ContextResourceResolverFactory.get(ContextResourceResolverFactory.java:69)
        at org.apache.sling.testing.mock.sling.context.SlingContextImpl.newResourceResolverFactory(SlingContextImpl.java:107)
        at org.apache.sling.testing.mock.sling.context.SlingContextImpl.setUp(SlingContextImpl.java:98)
        at org.apache.sling.testing.mock.sling.junit.SlingContext.access$000(SlingContext.java:32)
        at org.apache.sling.testing.mock.sling.junit.SlingContext$1.before(SlingContext.java:113)
        at org.junit.rules.ExternalResource$1.evaluate(ExternalResource.java:46)
        at org.junit.rules.RunRules.evaluate(RunRules.java:20)
        at org.junit.runners.ParentRunner.runLeaf(ParentRunner.java:325)
        at org.junit.runners.BlockJUnit4ClassRunner.runChild(BlockJUnit4ClassRunner.java:78)
        at org.junit.runners.BlockJUnit4ClassRunner.runChild(BlockJUnit4ClassRunner.java:57)
        at org.junit.runners.ParentRunner$3.run(ParentRunner.java:290)
        at org.junit.runners.ParentRunner$1.schedule(ParentRunner.java:71)
        at org.junit.runners.ParentRunner.runChildren(ParentRunner.java:288)
        at org.junit.runners.ParentRunner.access$000(ParentRunner.java:58)
        at org.junit.runners.ParentRunner$2.evaluate(ParentRunner.java:268)
        at org.junit.runners.ParentRunner.run(ParentRunner.java:363)
        at org.apache.maven.surefire.junit4.JUnit4Provider.execute(JUnit4Provider.java:283)
        at org.apache.maven.surefire.junit4.JUnit4Provider.executeWithRerun(JUnit4Provider.java:173)
        at org.apache.maven.surefire.junit4.JUnit4Provider.executeTestSet(JUnit4Provider.java:153)
        at org.apache.maven.surefire.junit4.JUnit4Provider.invoke(JUnit4Provider.java:128)
        at org.apache.maven.surefire.booter.ForkedBooter.invokeProviderInSameClassLoader(ForkedBooter.java:203)
        at org.apache.maven.surefire.booter.ForkedBooter.runSuitesInProcess(ForkedBooter.java:155)
        at org.apache.maven.surefire.booter.ForkedBooter.main(ForkedBooter.java:103)
Caused by: java.lang.RuntimeException: No matching activation method with name 'configure'  found in class org.apache.sling.serviceusermapping.impl.ServiceUserMapperImpl
        at org.apache.sling.testing.mock.osgi.OsgiServiceUtil.activateDeactivate(OsgiServiceUtil.java:157)
        at org.apache.sling.testing.mock.osgi.MockOsgi.activate(MockOsgi.java:190)
        at org.apache.sling.testing.mock.sling.ResourceResolverFactoryInitializer.registerServiceIfNotPresent(ResourceResolverFactoryInitializer.java:160)
        at org.apache.sling.testing.mock.sling.ResourceResolverFactoryInitializer.ensureResourceResolverFactoryActivatorDependencies(ResourceResolverFactoryInitializer.java:117)
        at org.apache.sling.testing.mock.sling.ResourceResolverFactoryInitializer.setUp(ResourceResolverFactoryInitializer.java:74)
        at org.apache.sling.testing.mock.sling.MockSling.newResourceResolverFactory(MockSling.java:88)
        at org.apache.sling.testing.mock.sling.context.ContextResourceResolverFactory.get(ContextResourceResolverFactory.java:45)
        at org.apache.sling.testing.mock.sling.context.SlingContextImpl.newResourceResolverFactory(SlingContextImpl.java:107)
        at org.apache.sling.testing.mock.sling.context.SlingContextImpl.setUp(SlingContextImpl.java:98)
        at org.apache.sling.testing.mock.sling.junit.SlingContext.access$000(SlingContext.java:32)
        at org.apache.sling.testing.mock.sling.junit.SlingContext$1.before(SlingContext.java:113)
        at org.junit.rules.ExternalResource$1.evaluate(ExternalResource.java:46)
        at org.junit.rules.RunRules.evaluate(RunRules.java:20)
        at org.junit.runners.ParentRunner.runLeaf(ParentRunner.java:325)
        at org.junit.runners.BlockJUnit4ClassRunner.runChild(BlockJUnit4ClassRunner.java:78)
        at org.junit.runners.BlockJUnit4ClassRunner.runChild(BlockJUnit4ClassRunner.java:57)
        at org.junit.runners.ParentRunner$3.run(ParentRunner.java:290)
        at org.junit.runners.ParentRunner$1.schedule(ParentRunner.java:71)
        at org.junit.runners.ParentRunner.runChildren(ParentRunner.java:288)
        at org.junit.runners.ParentRunner.access$000(ParentRunner.java:58)
        at org.junit.runners.ParentRunner$2.evaluate(ParentRunner.java:268)
        at org.junit.runners.ParentRunner.run(ParentRunner.java:363)
        at org.apache.maven.surefire.junit4.JUnit4Provider.execute(JUnit4Provider.java:283)
        at org.apache.maven.surefire.junit4.JUnit4Provider.executeWithRerun(JUnit4Provider.java:173)
        at org.apache.maven.surefire.junit4.JUnit4Provider.executeTestSet(JUnit4Provider.java:153)
        at org.apache.maven.surefire.junit4.JUnit4Provider.invoke(JUnit4Provider.java:128)
        at org.apache.maven.surefire.booter.ForkedBooter.invokeProviderInSameClassLoader(ForkedBooter.java:203)
        at org.apache.maven.surefire.booter.ForkedBooter.runSuitesInProcess(ForkedBooter.java:155)
        at org.apache.maven.surefire.booter.ForkedBooter.main(ForkedBooter.java:103)

noRepositoryOnException(org.apache.sling.jcr.base.RepositoryInitializersTest)  Time elapsed: 0.005 sec  <<< ERROR!
java.lang.RuntimeException: Unable to initialize JCR_MOCK resource resolver factory: No matching activation method with name 'configure'  found in class org.apache.sling.serviceusermapping.impl.ServiceUserMapperImpl
        at org.apache.sling.testing.mock.sling.context.ContextResourceResolverFactory.get(ContextResourceResolverFactory.java:69)
        at org.apache.sling.testing.mock.sling.context.SlingContextImpl.newResourceResolverFactory(SlingContextImpl.java:107)
        at org.apache.sling.testing.mock.sling.context.SlingContextImpl.setUp(SlingContextImpl.java:98)
        at org.apache.sling.testing.mock.sling.junit.SlingContext.access$000(SlingContext.java:32)
        at org.apache.sling.testing.mock.sling.junit.SlingContext$1.before(SlingContext.java:113)
        at org.junit.rules.ExternalResource$1.evaluate(ExternalResource.java:46)
        at org.junit.rules.RunRules.evaluate(RunRules.java:20)
        at org.junit.runners.ParentRunner.runLeaf(ParentRunner.java:325)
        at org.junit.runners.BlockJUnit4ClassRunner.runChild(BlockJUnit4ClassRunner.java:78)
        at org.junit.runners.BlockJUnit4ClassRunner.runChild(BlockJUnit4ClassRunner.java:57)
        at org.junit.runners.ParentRunner$3.run(ParentRunner.java:290)
        at org.junit.runners.ParentRunner$1.schedule(ParentRunner.java:71)
        at org.junit.runners.ParentRunner.runChildren(ParentRunner.java:288)
        at org.junit.runners.ParentRunner.access$000(ParentRunner.java:58)
        at org.junit.runners.ParentRunner$2.evaluate(ParentRunner.java:268)
        at org.junit.runners.ParentRunner.run(ParentRunner.java:363)
        at org.apache.maven.surefire.junit4.JUnit4Provider.execute(JUnit4Provider.java:283)
        at org.apache.maven.surefire.junit4.JUnit4Provider.executeWithRerun(JUnit4Provider.java:173)
        at org.apache.maven.surefire.junit4.JUnit4Provider.executeTestSet(JUnit4Provider.java:153)
        at org.apache.maven.surefire.junit4.JUnit4Provider.invoke(JUnit4Provider.java:128)
        at org.apache.maven.surefire.booter.ForkedBooter.invokeProviderInSameClassLoader(ForkedBooter.java:203)
        at org.apache.maven.surefire.booter.ForkedBooter.runSuitesInProcess(ForkedBooter.java:155)
        at org.apache.maven.surefire.booter.ForkedBooter.main(ForkedBooter.java:103)
Caused by: java.lang.RuntimeException: No matching activation method with name 'configure'  found in class org.apache.sling.serviceusermapping.impl.ServiceUserMapperImpl
        at org.apache.sling.testing.mock.osgi.OsgiServiceUtil.activateDeactivate(OsgiServiceUtil.java:157)
        at org.apache.sling.testing.mock.osgi.MockOsgi.activate(MockOsgi.java:190)
        at org.apache.sling.testing.mock.sling.ResourceResolverFactoryInitializer.registerServiceIfNotPresent(ResourceResolverFactoryInitializer.java:160)
        at org.apache.sling.testing.mock.sling.ResourceResolverFactoryInitializer.ensureResourceResolverFactoryActivatorDependencies(ResourceResolverFactoryInitializer.java:117)
        at org.apache.sling.testing.mock.sling.ResourceResolverFactoryInitializer.setUp(ResourceResolverFactoryInitializer.java:74)
        at org.apache.sling.testing.mock.sling.MockSling.newResourceResolverFactory(MockSling.java:88)
        at org.apache.sling.testing.mock.sling.context.ContextResourceResolverFactory.get(ContextResourceResolverFactory.java:45)
        at org.apache.sling.testing.mock.sling.context.SlingContextImpl.newResourceResolverFactory(SlingContextImpl.java:107)
        at org.apache.sling.testing.mock.sling.context.SlingContextImpl.setUp(SlingContextImpl.java:98)
        at org.apache.sling.testing.mock.sling.junit.SlingContext.access$000(SlingContext.java:32)
        at org.apache.sling.testing.mock.sling.junit.SlingContext$1.before(SlingContext.java:113)
        at org.junit.rules.ExternalResource$1.evaluate(ExternalResource.java:46)
        at org.junit.rules.RunRules.evaluate(RunRules.java:20)
        at org.junit.runners.ParentRunner.runLeaf(ParentRunner.java:325)
        at org.junit.runners.BlockJUnit4ClassRunner.runChild(BlockJUnit4ClassRunner.java:78)
        at org.junit.runners.BlockJUnit4ClassRunner.runChild(BlockJUnit4ClassRunner.java:57)
        at org.junit.runners.ParentRunner$3.run(ParentRunner.java:290)
        at org.junit.runners.ParentRunner$1.schedule(ParentRunner.java:71)
        at org.junit.runners.ParentRunner.runChildren(ParentRunner.java:288)
        at org.junit.runners.ParentRunner.access$000(ParentRunner.java:58)
        at org.junit.runners.ParentRunner$2.evaluate(ParentRunner.java:268)
        at org.junit.runners.ParentRunner.run(ParentRunner.java:363)
        at org.apache.maven.surefire.junit4.JUnit4Provider.execute(JUnit4Provider.java:283)
        at org.apache.maven.surefire.junit4.JUnit4Provider.executeWithRerun(JUnit4Provider.java:173)
        at org.apache.maven.surefire.junit4.JUnit4Provider.executeTestSet(JUnit4Provider.java:153)
        at org.apache.maven.surefire.junit4.JUnit4Provider.invoke(JUnit4Provider.java:128)
        at org.apache.maven.surefire.booter.ForkedBooter.invokeProviderInSameClassLoader(ForkedBooter.java:203)
        at org.apache.maven.surefire.booter.ForkedBooter.runSuitesInProcess(ForkedBooter.java:155)
        at org.apache.maven.surefire.booter.ForkedBooter.main(ForkedBooter.java:103)

reverseOrderInitializers(org.apache.sling.jcr.base.RepositoryInitializersTest)  Time elapsed: 0.005 sec  <<< ERROR!
java.lang.RuntimeException: Unable to initialize JCR_MOCK resource resolver factory: No matching activation method with name 'configure'  found in class org.apache.sling.serviceusermapping.impl.ServiceUserMapperImpl
        at org.apache.sling.testing.mock.sling.context.ContextResourceResolverFactory.get(ContextResourceResolverFactory.java:69)
        at org.apache.sling.testing.mock.sling.context.SlingContextImpl.newResourceResolverFactory(SlingContextImpl.java:107)
        at org.apache.sling.testing.mock.sling.context.SlingContextImpl.setUp(SlingContextImpl.java:98)
        at org.apache.sling.testing.mock.sling.junit.SlingContext.access$000(SlingContext.java:32)
        at org.apache.sling.testing.mock.sling.junit.SlingContext$1.before(SlingContext.java:113)
        at org.junit.rules.ExternalResource$1.evaluate(ExternalResource.java:46)
        at org.junit.rules.RunRules.evaluate(RunRules.java:20)
        at org.junit.runners.ParentRunner.runLeaf(ParentRunner.java:325)
        at org.junit.runners.BlockJUnit4ClassRunner.runChild(BlockJUnit4ClassRunner.java:78)
        at org.junit.runners.BlockJUnit4ClassRunner.runChild(BlockJUnit4ClassRunner.java:57)
        at org.junit.runners.ParentRunner$3.run(ParentRunner.java:290)
        at org.junit.runners.ParentRunner$1.schedule(ParentRunner.java:71)
        at org.junit.runners.ParentRunner.runChildren(ParentRunner.java:288)
        at org.junit.runners.ParentRunner.access$000(ParentRunner.java:58)
        at org.junit.runners.ParentRunner$2.evaluate(ParentRunner.java:268)
        at org.junit.runners.ParentRunner.run(ParentRunner.java:363)
        at org.apache.maven.surefire.junit4.JUnit4Provider.execute(JUnit4Provider.java:283)
        at org.apache.maven.surefire.junit4.JUnit4Provider.executeWithRerun(JUnit4Provider.java:173)
        at org.apache.maven.surefire.junit4.JUnit4Provider.executeTestSet(JUnit4Provider.java:153)
        at org.apache.maven.surefire.junit4.JUnit4Provider.invoke(JUnit4Provider.java:128)
        at org.apache.maven.surefire.booter.ForkedBooter.invokeProviderInSameClassLoader(ForkedBooter.java:203)
        at org.apache.maven.surefire.booter.ForkedBooter.runSuitesInProcess(ForkedBooter.java:155)
        at org.apache.maven.surefire.booter.ForkedBooter.main(ForkedBooter.java:103)
Caused by: java.lang.RuntimeException: No matching activation method with name 'configure'  found in class org.apache.sling.serviceusermapping.impl.ServiceUserMapperImpl
        at org.apache.sling.testing.mock.osgi.OsgiServiceUtil.activateDeactivate(OsgiServiceUtil.java:157)
        at org.apache.sling.testing.mock.osgi.MockOsgi.activate(MockOsgi.java:190)
        at org.apache.sling.testing.mock.sling.ResourceResolverFactoryInitializer.registerServiceIfNotPresent(ResourceResolverFactoryInitializer.java:160)
        at org.apache.sling.testing.mock.sling.ResourceResolverFactoryInitializer.ensureResourceResolverFactoryActivatorDependencies(ResourceResolverFactoryInitializer.java:117)
        at org.apache.sling.testing.mock.sling.ResourceResolverFactoryInitializer.setUp(ResourceResolverFactoryInitializer.java:74)
        at org.apache.sling.testing.mock.sling.MockSling.newResourceResolverFactory(MockSling.java:88)
        at org.apache.sling.testing.mock.sling.context.ContextResourceResolverFactory.get(ContextResourceResolverFactory.java:45)
        at org.apache.sling.testing.mock.sling.context.SlingContextImpl.newResourceResolverFactory(SlingContextImpl.java:107)
        at org.apache.sling.testing.mock.sling.context.SlingContextImpl.setUp(SlingContextImpl.java:98)
        at org.apache.sling.testing.mock.sling.junit.SlingContext.access$000(SlingContext.java:32)
        at org.apache.sling.testing.mock.sling.junit.SlingContext$1.before(SlingContext.java:113)
        at org.junit.rules.ExternalResource$1.evaluate(ExternalResource.java:46)
        at org.junit.rules.RunRules.evaluate(RunRules.java:20)
        at org.junit.runners.ParentRunner.runLeaf(ParentRunner.java:325)
        at org.junit.runners.BlockJUnit4ClassRunner.runChild(BlockJUnit4ClassRunner.java:78)
        at org.junit.runners.BlockJUnit4ClassRunner.runChild(BlockJUnit4ClassRunner.java:57)
        at org.junit.runners.ParentRunner$3.run(ParentRunner.java:290)
        at org.junit.runners.ParentRunner$1.schedule(ParentRunner.java:71)
        at org.junit.runners.ParentRunner.runChildren(ParentRunner.java:288)
        at org.junit.runners.ParentRunner.access$000(ParentRunner.java:58)
        at org.junit.runners.ParentRunner$2.evaluate(ParentRunner.java:268)
        at org.junit.runners.ParentRunner.run(ParentRunner.java:363)
        at org.apache.maven.surefire.junit4.JUnit4Provider.execute(JUnit4Provider.java:283)
        at org.apache.maven.surefire.junit4.JUnit4Provider.executeWithRerun(JUnit4Provider.java:173)
        at org.apache.maven.surefire.junit4.JUnit4Provider.executeTestSet(JUnit4Provider.java:153)
        at org.apache.maven.surefire.junit4.JUnit4Provider.invoke(JUnit4Provider.java:128)
        at org.apache.maven.surefire.booter.ForkedBooter.invokeProviderInSameClassLoader(ForkedBooter.java:203)
        at org.apache.maven.surefire.booter.ForkedBooter.runSuitesInProcess(ForkedBooter.java:155)
        at org.apache.maven.surefire.booter.ForkedBooter.main(ForkedBooter.java:103)

Running org.apache.sling.jcr.base.util.AccessControlUtilTest
Tests run: 1, Failures: 0, Errors: 0, Skipped: 0, Time elapsed: 0 sec - in org.apache.sling.jcr.base.util.AccessControlUtilTest

Results :

Tests in error:
  RepositoryInitializersTest.inOrderInitializers » Runtime Unable to initialize ...
  RepositoryInitializersTest.noRepositoryOnError » Runtime Unable to initialize ...
  RepositoryInitializersTest.noRepositoryOnException » Runtime Unable to initial...
  RepositoryInitializersTest.reverseOrderInitializers » Runtime Unable to initia...
{code}

I spottet the error when introducing an extension to  the {{org.apache.sling.serviceusermapper}} and tried to update {{org.apache.sling.jcr.base}}.

Revering my changes and just updating the version to the latest stable release, showed the exact same problem and I concluded that the problem is located elsewhere.

[~asanso], as discuss i am going to assign this issue to you.



--
This message was sent by Atlassian JIRA
(v6.4.14#64029)